Reaction Details
TargetTyrosine-protein kinase ITK/TSK
LigandBDBM50086659
Substrate/Competitorn/a
Meas. Tech.ChEMBL_1477113 (CHEMBL3428280)
Ki 0.300000±n/a nM
Citation Burch, JDBarrett, KChen, YDeVoss, JEigenbrot, CGoldsmith, RIsmaili, MHLau, KLin, ZOrtwine, DFZarrin, AAMcEwan, PABarker, JJEllebrandt, CKordt, DStein, DBWang, XChen, YHu, BXu, XYuen, PWZhang, YPei, Z Tetrahydroindazoles as Interleukin-2 Inducible T-Cell Kinase Inhibitors. Part II. Second-Generation Analogues with Enhanced Potency, Selectivity, and Pharmacodynamic Modulation in Vivo. J Med Chem58:3806-16 (2015) 
 
Tyrosine-protein kinase ITK/TSK
Name:Tyrosine-protein kinase ITK/TSK
Type:Protein
Mol. Mass.:71839.20
Organism:Homo sapiens (Human)
Description:Q08881
Residue:620
BDBM50086659
NameBDBM50086659
Synonyms:CHEMBL3426303
TypeSmall organic molecule
Emp. Form.C25H31N5O3S
Mol. Mass.481.61
SMILESCC1(C)CCc2c(C1)[nH]nc2C(=O)Nc1cnn(c1)[C@@H](C1CCCCS1(=O)=O)c1ccccc1