Reaction Details
TargetTyrosine-protein kinase ITK/TSK
LigandBDBM50086669
Substrate/Competitorn/a
Meas. Tech.ChEMBL_1477113 (CHEMBL3428280)
Ki 0.900±n/a nM
Citation Burch, JDBarrett, KChen, YDeVoss, JEigenbrot, CGoldsmith, RIsmaili, MHLau, KLin, ZOrtwine, DFZarrin, AAMcEwan, PABarker, JJEllebrandt, CKordt, DStein, DBWang, XChen, YHu, BXu, XYuen, PWZhang, YPei, Z Tetrahydroindazoles as Interleukin-2 Inducible T-Cell Kinase Inhibitors. Part II. Second-Generation Analogues with Enhanced Potency, Selectivity, and Pharmacodynamic Modulation in Vivo. J Med Chem58:3806-16 (2015) 
 
Tyrosine-protein kinase ITK/TSK
Name:Tyrosine-protein kinase ITK/TSK
Type:Protein
Mol. Mass.:71839.20
Organism:Homo sapiens (Human)
Description:Q08881
Residue:620
BDBM50086669
NameBDBM50086669
Synonyms:CHEMBL3426301
TypeSmall organic molecule
Emp. Form.C24H29N5O3S
Mol. Mass.467.584
SMILESCC1(C)CCc2c(C1)[nH]nc2C(=O)Nc1cnn(c1)[C@@H](C1CCS(=O)(=O)C1)c1ccccc1