Reaction Details
TargetApoptosis regulator Bcl-2
LigandBDBM50086692
Substrate/Competitorn/a
Meas. Tech.ChEMBL_1477330 (CHEMBL3429296)
Ki 770±n/a nM
Citation Burke, JPBian, ZShaw, SZhao, BGoodwin, CMBelmar, JBrowning, CFVigil, DFriberg, ACamper, DVRossanese, OWLee, TOlejniczak, ETFesik, SW Discovery of tricyclic indoles that potently inhibit Mcl-1 using fragment-based methods and structure-based design. J Med Chem58:3794-805 (2015) 
 
Apoptosis regulator Bcl-2
Name:Apoptosis regulator Bcl-2
Type:Homodimer or heterodimer
Mol. Mass.:26269.11
Organism:Homo sapiens (Human)
Description:P10415
Residue:239
BDBM50086692
NameBDBM50086692
Synonyms:CHEMBL3426333
TypeSmall organic molecule
Emp. Form.C23H23Cl2NO3
Mol. Mass.432.34
SMILESCc1cc(OCCCc2c(C(O)=O)n3CCCc4c(Cl)ccc2c34)cc(C)c1Cl