Reaction Details
TargetCarbonic anhydrase 2
LigandBDBM50087047
Substrate/Competitorn/a
Meas. Tech.ChEMBL_1477827 (CHEMBL3428962)
Ki>10000±n/a nM
Citation Grandane, ATanc, MDi Cesare Mannelli, LCarta, FGhelardini, C?alubovskis, RSupuran, CT 6-Substituted sulfocoumarins are selective carbonic anhdydrase IX and XII inhibitors with significant cytotoxicity against colorectal cancer cells. J Med Chem58:3975-83 (2015) 
 
Carbonic anhydrase 2
Name:Carbonic anhydrase 2
Type:Enzyme
Mol. Mass.:29250.71
Organism:Homo sapiens (Human)
Description:P00918
Residue:260
BDBM50087047
NameBDBM50087047
Synonyms:CHEMBL3426537
TypeSmall organic molecule
Emp. Form.C13H9NO4S2
Mol. Mass.307.345
SMILESO=C(Nc1ccc2OS(=O)(=O)C=Cc2c1)c1cccs1