Reaction Details
TargetCarbonic anhydrase 2
LigandBDBM50087049
Substrate/Competitorn/a
Meas. Tech.ChEMBL_1477827 (CHEMBL3428962)
Ki>10000±n/a nM
Citation Grandane, ATanc, MDi Cesare Mannelli, LCarta, FGhelardini, C?alubovskis, RSupuran, CT 6-Substituted sulfocoumarins are selective carbonic anhdydrase IX and XII inhibitors with significant cytotoxicity against colorectal cancer cells. J Med Chem58:3975-83 (2015) 
 
Carbonic anhydrase 2
Name:Carbonic anhydrase 2
Type:Enzyme
Mol. Mass.:29250.71
Organism:Homo sapiens (Human)
Description:P00918
Residue:260
BDBM50087049
NameBDBM50087049
Synonyms:CHEMBL3426535
TypeSmall organic molecule
Emp. Form.C15H10INO4S
Mol. Mass.427.214
SMILESIc1ccccc1C(=O)Nc1ccc2OS(=O)(=O)C=Cc2c1