Reaction Details
TargetCarbonic anhydrase 1
LigandBDBM50087046
Substrate/Competitorn/a
Meas. Tech.ChEMBL_1477826 (CHEMBL3428830)
Ki>10000±n/a nM
Citation Grandane, ATanc, MDi Cesare Mannelli, LCarta, FGhelardini, C?alubovskis, RSupuran, CT 6-Substituted sulfocoumarins are selective carbonic anhdydrase IX and XII inhibitors with significant cytotoxicity against colorectal cancer cells. J Med Chem58:3975-83 (2015) 
 
Carbonic anhydrase 1
Name:Carbonic anhydrase 1
Type:Enzyme
Mol. Mass.:28873.37
Organism:Homo sapiens (Human)
Description:P00915
Residue:261
BDBM50087046
NameBDBM50087046
Synonyms:CHEMBL3426538
TypeSmall organic molecule
Emp. Form.C13H9NO5S
Mol. Mass.291.279
SMILESO=C(Nc1ccc2OS(=O)(=O)C=Cc2c1)c1ccco1