Reaction Details
TargetCarbonic anhydrase 12
LigandBDBM50087053
Substrate/Competitorn/a
Meas. Tech.ChEMBL_1477829 (CHEMBL3428964)
Ki 3.2±n/a nM
Citation Grandane, ATanc, MDi Cesare Mannelli, LCarta, FGhelardini, C?alubovskis, RSupuran, CT 6-Substituted sulfocoumarins are selective carbonic anhdydrase IX and XII inhibitors with significant cytotoxicity against colorectal cancer cells. J Med Chem58:3975-83 (2015) 
 
Carbonic anhydrase 12
Name:Carbonic anhydrase 12
Type:Enzyme
Mol. Mass.:39456.00
Organism:Homo sapiens (Human)
Description:Catalytic domain of human cloned isozyme was used in the assay
Residue:354
BDBM50087053
NameBDBM50087053
Synonyms:CHEMBL3426531
TypeSmall organic molecule
Emp. Form.C13H15NO4S
Mol. Mass.281.328
SMILESCC(C)(C)C(=O)Nc1ccc2OS(=O)(=O)C=Cc2c1