Reaction Details
TargetCarbonic anhydrase 12
LigandBDBM50087048
Substrate/Competitorn/a
Meas. Tech.ChEMBL_1477829 (CHEMBL3428964)
Ki 4.0±n/a nM
Citation Grandane, ATanc, MDi Cesare Mannelli, LCarta, FGhelardini, C?alubovskis, RSupuran, CT 6-Substituted sulfocoumarins are selective carbonic anhdydrase IX and XII inhibitors with significant cytotoxicity against colorectal cancer cells. J Med Chem58:3975-83 (2015) 
 
Carbonic anhydrase 12
Name:Carbonic anhydrase 12
Type:Enzyme
Mol. Mass.:39456.00
Organism:Homo sapiens (Human)
Description:Catalytic domain of human cloned isozyme was used in the assay
Residue:354
BDBM50087048
NameBDBM50087048
Synonyms:CHEMBL3426536
TypeSmall organic molecule
Emp. Form.C16H13NO4S
Mol. Mass.315.344
SMILESO=C(Cc1ccccc1)Nc1ccc2OS(=O)(=O)C=Cc2c1