Reaction Details
TargetRho-associated protein kinase 2
LigandBDBM50087128
Substrate/Competitorn/a
Meas. Tech.ChEMBL_1478012 (CHEMBL3429820)
IC50 72±n/a nM
Citation Boland, SBourin, AAlen, JGeraets, JSchroeders, PCastermans, KKindt, NBoumans, NPanitti, LFransen, SVanormelingen, JStassen, JMLeysen, DDefert, O Design, synthesis, and biological evaluation of novel, highly active soft ROCK inhibitors. J Med Chem58:4309-24 (2015) 
 
Rho-associated protein kinase 2
Name:Rho-associated protein kinase 2
Type:Protein
Mol. Mass.:160885.43
Organism:Homo sapiens (Human)
Description:O75116
Residue:1388
BDBM50087128
NameBDBM50087128
Synonyms:CHEMBL3426635
TypeSmall organic molecule
Emp. Form.C31H28F2N4O4
Mol. Mass.558.5752
SMILESCC[C@H](C)OC(=O)c1ccc(F)c(NC(=O)c2cccc(c2)-c2cc(ccc2CN)C(=O)Nc2ccncc2F)c1