Reaction Details
TargetRho-associated protein kinase 2
LigandBDBM50087165
Substrate/Competitorn/a
Meas. Tech.ChEMBL_1478011 (CHEMBL3429819)
IC50<1.000000±n/a nM
Citation Boland, SBourin, AAlen, JGeraets, JSchroeders, PCastermans, KKindt, NBoumans, NPanitti, LFransen, SVanormelingen, JStassen, JMLeysen, DDefert, O Design, synthesis, and biological evaluation of novel, highly active soft ROCK inhibitors. J Med Chem58:4309-24 (2015) 
 
Rho-associated protein kinase 2
Name:Rho-associated protein kinase 2
Type:Protein
Mol. Mass.:160885.43
Organism:Homo sapiens (Human)
Description:O75116
Residue:1388
BDBM50087165
NameBDBM50087165
Synonyms:CHEMBL3426729
TypeSmall organic molecule
Emp. Form.C34H34FN5O4
Mol. Mass.595.6633
SMILESCN1CCC(CC1)OC(=O)Cc1ccc(NC(=O)c2cccc(c2)-c2cc(ccc2CN)C(=O)Nc2ccncc2F)cc1