Reaction Details
TargetRho-associated protein kinase 2
LigandBDBM50087442
Substrate/Competitorn/a
Meas. Tech.ChEMBL_1478011 (CHEMBL3429819)
IC50 3.3±n/a nM
Citation Boland, SBourin, AAlen, JGeraets, JSchroeders, PCastermans, KKindt, NBoumans, NPanitti, LFransen, SVanormelingen, JStassen, JMLeysen, DDefert, O Design, synthesis, and biological evaluation of novel, highly active soft ROCK inhibitors. J Med Chem58:4309-24 (2015) 
 
Rho-associated protein kinase 2
Name:Rho-associated protein kinase 2
Type:Protein
Mol. Mass.:160885.43
Organism:Homo sapiens (Human)
Description:O75116
Residue:1388
BDBM50087442
NameBDBM50087442
Synonyms:CHEMBL3426628
TypeSmall organic molecule
Emp. Form.C27H21FN4O4
Mol. Mass.484.4784
SMILESNCc1ccc(cc1-c1cccc(c1)C(=O)Nc1ccc(cc1)C(O)=O)C(=O)Nc1ccncc1F