Reaction Details
TargetHeat shock protein 75 kDa, mitochondrial
LigandBDBM50165300
Substrate/Competitorn/a
Meas. Tech.ChEMBL_1478164 (CHEMBL3427925)
IC50 203700±n/a nM
Citation Patel, HJPatel, PDOchiana, SOYan, PSun, WPatel, MRShah, SKTramentozzi, EBrooks, JBolaender, AShrestha, LStephani, RFinotti, PLeifer, CLi, ZGewirth, DTTaldone, TChiosis, G Structure-activity relationship in a purine-scaffold compound series with selectivity for the endoplasmic reticulum Hsp90 paralog Grp94. J Med Chem58:3922-43 (2015) 
 
Heat shock protein 75 kDa, mitochondrial
Name:Heat shock protein 75 kDa, mitochondrial
Type:PROTEIN
Mol. Mass.:80120.13
Organism:Homo sapiens (Human)
Description:ChEMBL_1478164
Residue:704
BDBM50165300
NameBDBM50165300
Synonyms:8-(2,5-Dimethyl-phenylsulfanyl)-9-pent-4-ynyl-9H-purin-6-ylamine | CHEMBL364239
TypeSmall organic molecule
Emp. Form.C18H19N5S
Mol. Mass.337.442
SMILESCc1ccc(C)c(Sc2nc3c(N)ncnc3n2CCCC#C)c1