Reaction Details
TargetHeat shock protein 75 kDa, mitochondrial
LigandBDBM50180302
Substrate/Competitorn/a
Meas. Tech.ChEMBL_1478164 (CHEMBL3427925)
IC50 205±n/a nM
Citation Patel, HJPatel, PDOchiana, SOYan, PSun, WPatel, MRShah, SKTramentozzi, EBrooks, JBolaender, AShrestha, LStephani, RFinotti, PLeifer, CLi, ZGewirth, DTTaldone, TChiosis, G Structure-activity relationship in a purine-scaffold compound series with selectivity for the endoplasmic reticulum Hsp90 paralog Grp94. J Med Chem58:3922-43 (2015) 
 
Heat shock protein 75 kDa, mitochondrial
Name:Heat shock protein 75 kDa, mitochondrial
Type:PROTEIN
Mol. Mass.:80120.13
Organism:Homo sapiens (Human)
Description:ChEMBL_1478164
Residue:704
BDBM50180302
NameBDBM50180302
Synonyms:8-(6-iodo-benzo[1,3]dioxol-5-ylsulfanyl)-9-(3-isopropylamino-propyl)adenine 8-[(6-IODO-1,3-BENZODIOXOL-5-YL)THIO]-9-[3-(ISOPROPYLAMINO)PROPYL]-9H-PURIN-6-AMINE US10336757, Compound PU-H71 | US10676476, Example 9
TypeSmall organic molecule
Emp. Form.C18H21IN6O2S
Mol. Mass.512.368
SMILESCC(C)NCCCn1c(Sc2cc3OCOc3cc2I)nc2c(N)ncnc12