Reaction Details
TargetHeat shock protein 75 kDa, mitochondrial
LigandBDBM50087507
Substrate/Competitorn/a
Meas. Tech.ChEMBL_1478164 (CHEMBL3427925)
IC50 4580±n/a nM
Citation Patel, HJPatel, PDOchiana, SOYan, PSun, WPatel, MRShah, SKTramentozzi, EBrooks, JBolaender, AShrestha, LStephani, RFinotti, PLeifer, CLi, ZGewirth, DTTaldone, TChiosis, G Structure-activity relationship in a purine-scaffold compound series with selectivity for the endoplasmic reticulum Hsp90 paralog Grp94. J Med Chem58:3922-43 (2015) 
 
Heat shock protein 75 kDa, mitochondrial
Name:Heat shock protein 75 kDa, mitochondrial
Type:PROTEIN
Mol. Mass.:80120.13
Organism:Homo sapiens (Human)
Description:ChEMBL_1478164
Residue:704
BDBM50087507
NameBDBM50087507
Synonyms:CHEMBL3426748
TypeSmall organic molecule
Emp. Form.C15H12Cl2N6S
Mol. Mass.379.267
SMILESNc1ncnc2n(CCCC#N)c(Sc3cc(Cl)cc(Cl)c3)nc12