Reaction Details
TargetHeat shock protein 75 kDa, mitochondrial
LigandBDBM50087649
Substrate/Competitorn/a
Meas. Tech.ChEMBL_1478164 (CHEMBL3427925)
IC50 9600±n/a nM
Citation Patel, HJPatel, PDOchiana, SOYan, PSun, WPatel, MRShah, SKTramentozzi, EBrooks, JBolaender, AShrestha, LStephani, RFinotti, PLeifer, CLi, ZGewirth, DTTaldone, TChiosis, G Structure-activity relationship in a purine-scaffold compound series with selectivity for the endoplasmic reticulum Hsp90 paralog Grp94. J Med Chem58:3922-43 (2015) 
 
Heat shock protein 75 kDa, mitochondrial
Name:Heat shock protein 75 kDa, mitochondrial
Type:PROTEIN
Mol. Mass.:80120.13
Organism:Homo sapiens (Human)
Description:ChEMBL_1478164
Residue:704
BDBM50087649
NameBDBM50087649
Synonyms:CHEMBL3426768
TypeSmall organic molecule
Emp. Form.C15H12Cl2N6S
Mol. Mass.379.267
SMILESNc1ncn(CCCC#N)c2nc(Sc3ccc(Cl)cc3Cl)nc12