Reaction Details
TargetHeat shock protein 75 kDa, mitochondrial
LigandBDBM50087721
Substrate/Competitorn/a
Meas. Tech.ChEMBL_1478164 (CHEMBL3427925)
IC50 7300±n/a nM
Citation Patel, HJPatel, PDOchiana, SOYan, PSun, WPatel, MRShah, SKTramentozzi, EBrooks, JBolaender, AShrestha, LStephani, RFinotti, PLeifer, CLi, ZGewirth, DTTaldone, TChiosis, G Structure-activity relationship in a purine-scaffold compound series with selectivity for the endoplasmic reticulum Hsp90 paralog Grp94. J Med Chem58:3922-43 (2015) 
 
Heat shock protein 75 kDa, mitochondrial
Name:Heat shock protein 75 kDa, mitochondrial
Type:PROTEIN
Mol. Mass.:80120.13
Organism:Homo sapiens (Human)
Description:ChEMBL_1478164
Residue:704
BDBM50087721
NameBDBM50087721
Synonyms:CHEMBL3426781
TypeSmall organic molecule
Emp. Form.C17H20Cl2N6S
Mol. Mass.411.352
SMILESCC(C)NCCCn1c(Sc2cc(Cl)cc(Cl)c2)nc2c(N)ncnc12