Reaction Details
TargetMu-type opioid receptor
LigandBDBM50087839
Substrate/Competitorn/a
Meas. Tech.ChEMBL_1478283 (CHEMBL3428523)
EC50 10000±n/a nM
Citation Burford, NTLivingston, KECanals, MRyan, MRBudenholzer, LMHan, YShang, YHerbst, JJO'Connell, JBanks, MZhang, LFilizola, MBassoni, DLWehrman, TSChristopoulos, ATraynor, JRGerritz, SWAlt, A Discovery, synthesis, and molecular pharmacology of selective positive allosteric modulators of thed-opioid receptor. J Med Chem58:4220-9 (2015) 
 
Mu-type opioid receptor
Name:Mu-type opioid receptor
Type:G Protein-Coupled Receptor (GPCR)
Mol. Mass.:44789.51
Organism:Homo sapiens (Human)
Description:P35372
Residue:400
BDBM50087839
NameBDBM50087839
Synonyms:CHEMBL3426801
TypeSmall organic molecule
Emp. Form.C31H34O5
Mol. Mass.486.5987
SMILESCC1(C)CC(=O)C2=C(C1)OC1=C(C2c2ccc(OCc3ccccc3CO)cc2)C(=O)CC(C)(C)C1