Reaction Details
TargetDelta-type opioid receptor
LigandBDBM50087826
Substrate/Competitorn/a
Meas. Tech.ChEMBL_1478287 (CHEMBL3428527)
Ki 5.0±n/a nM
Citation Burford, NTLivingston, KECanals, MRyan, MRBudenholzer, LMHan, YShang, YHerbst, JJO'Connell, JBanks, MZhang, LFilizola, MBassoni, DLWehrman, TSChristopoulos, ATraynor, JRGerritz, SWAlt, A Discovery, synthesis, and molecular pharmacology of selective positive allosteric modulators of thed-opioid receptor. J Med Chem58:4220-9 (2015) 
 
Delta-type opioid receptor
Name:Delta-type opioid receptor
Type:G Protein-Coupled Receptor (GPCR)
Mol. Mass.:40382.98
Organism:Homo sapiens (Human)
Description:Competition binding assays were carried out using membrane preparations from transfected HN9.10 cells that constitutively expressed the delta opioid receptor.
Residue:372
BDBM50087826
NameBDBM50087826
Synonyms:CHEMBL3426789
TypeSmall organic molecule
Emp. Form.C31H34O4
Mol. Mass.470.5993
SMILESCc1ccccc1COc1ccc(cc1)C1C2=C(CC(C)(C)CC2=O)OC2=C1C(=O)CC(C)(C)C2