Reaction Details
TargetHistone deacetylase 7
LigandBDBM50087841
Substrate/Competitorn/a
Meas. Tech.ChEMBL_1478440 (CHEMBL3429378)
IC50 8770±n/a nM
Citation Di Pompo, GSalerno, MRotili, DValente, SZwergel, CAvnet, SLattanzi, GBaldini, NMai, A Novel histone deacetylase inhibitors induce growth arrest, apoptosis, and differentiation in sarcoma cancer stem cells. J Med Chem58:4073-9 (2015) 
 
Histone deacetylase 7
Name:Histone deacetylase 7
Type:Chromatin regulator; hydrolase; repressor
Mol. Mass.:102942.62
Organism:Homo sapiens (Human)
Description:Q8WUI4
Residue:952
BDBM50087841
NameBDBM50087841
Synonyms:CHEMBL3426804
TypeSmall organic molecule
Emp. Form.C23H21N3O3
Mol. Mass.387.4311
SMILESONC(=O)\C=C\c1ccc(NC(=O)C(Cc2ccccc2)c2ccccc2)cn1