Reaction Details
TargetHistone deacetylase 7
LigandBDBM50087845
Substrate/Competitorn/a
Meas. Tech.ChEMBL_1478440 (CHEMBL3429378)
IC50>50000±n/a nM
Citation Di Pompo, GSalerno, MRotili, DValente, SZwergel, CAvnet, SLattanzi, GBaldini, NMai, A Novel histone deacetylase inhibitors induce growth arrest, apoptosis, and differentiation in sarcoma cancer stem cells. J Med Chem58:4073-9 (2015) 
 
Histone deacetylase 7
Name:Histone deacetylase 7
Type:Chromatin regulator; hydrolase; repressor
Mol. Mass.:102942.62
Organism:Homo sapiens (Human)
Description:Q8WUI4
Residue:952
BDBM50087845
NameBDBM50087845
Synonyms:CHEMBL3426803
TypeSmall organic molecule
Emp. Form.C21H21N3O3S
Mol. Mass.395.475
SMILESONC(=O)CCCCSc1nc(cc(=O)[nH]1)-c1ccc(cc1)-c1ccccc1