Reaction Details
TargetHistone deacetylase 4
LigandBDBM50087841
Substrate/Competitorn/a
Meas. Tech.ChEMBL_1478437 (CHEMBL3429375)
IC50 11700±n/a nM
Citation Di Pompo, GSalerno, MRotili, DValente, SZwergel, CAvnet, SLattanzi, GBaldini, NMai, A Novel histone deacetylase inhibitors induce growth arrest, apoptosis, and differentiation in sarcoma cancer stem cells. J Med Chem58:4073-9 (2015) 
 
Histone deacetylase 4
Name:Histone deacetylase 4
Type:Enzyme
Mol. Mass.:119049.39
Organism:Homo sapiens (Human)
Description:P56524
Residue:1084
BDBM50087841
NameBDBM50087841
Synonyms:CHEMBL3426804
TypeSmall organic molecule
Emp. Form.C23H21N3O3
Mol. Mass.387.4311
SMILESONC(=O)\C=C\c1ccc(NC(=O)C(Cc2ccccc2)c2ccccc2)cn1