Reaction Details
TargetC-X-C chemokine receptor type 2
LigandBDBM150812
Substrate/Competitorn/a
Meas. Tech.ChEMBL_1476504 (CHEMBL3427963)
IC50 130±n/a nM
Citation Maeda, DYPeck, AMSchuler, ADQuinn, MTKirpotina, LNWicomb, WNAuten, RLGundla, RZebala, JA Boronic acid-containing CXCR1/2 antagonists: Optimization of metabolic stability, in vivo evaluation, and a proposed receptor binding model. Bioorg Med Chem Lett25:2280-4 (2015) 
 
C-X-C chemokine receptor type 2
Name:C-X-C chemokine receptor type 2
Type:Protein
Mol. Mass.:40767.88
Organism:Homo sapiens (Human)
Description:P25025
Residue:360
BDBM150812
NameBDBM150812
Synonyms:US8981106, 2 (SX-576) | USRE47267, Compound 2
TypeSmall organic molecule
Emp. Form.C20H15BF4N2O4S
Mol. Mass.466.214
SMILESOB(O)c1ccc(OC(F)(F)F)cc1CSc1ccc(cn1)C(=O)Nc1ccc(F)cc1