Reaction Details
TargetMetabotropic glutamate receptor 6
LigandBDBM50007548
Substrate/Competitorn/a
Meas. Tech.ChEMBL_1476726 (CHEMBL3429077)
EC50 3450±n/a nM
Citation Ivashkin, PLemonnier, GTora, ASPin, JPGoudet, CJubault, PPannecoucke, X Synthesis and studies on the mGluR agonist activity of FAP4 stereoisomers. Bioorg Med Chem Lett25:2523-6 (2015) 
 
Metabotropic glutamate receptor 6
Name:Metabotropic glutamate receptor 6
Type:Enzyme
Mol. Mass.:95095.82
Organism:Rattus norvegicus (Rat)
Description:P35349
Residue:871
BDBM50007548
NameBDBM50007548
Synonyms:(S)-2-Amino-4-phosphono-butyric acid 2-Amino-3-(3,5-dioxo-[1,2,4]oxadiazolidin-2-yl)-propionic acid 2-Amino-4-phosphono-butyric acid(S-AP4) 2-amino-4-phosphonobutyric acid L-(+)-2-amino-4-phosphonobutyric acid L-AP4 | L-APB
TypeSmall organic molecule
Emp. Form.C4H10NO5P
Mol. Mass.183.0997
SMILESN[C@@H](CCP(O)(O)=O)C(O)=O