Reaction Details
TargetNAD-dependent protein deacetylase sirtuin-1
LigandBDBM50088294
Substrate/Competitorn/a
Meas. Tech.ChEMBL_1476843 (CHEMBL3429766)
IC50 2200±n/a nM
Citation Therrien, ELarouche, GNguyen, NRahil, JLemieux, AMLi, ZFournel, MYan, TPLandry, AJLefebvre, SWang, JJMacBeth, KHeise, CNguyen, ABesterman, JMDéziel, RWahhab, A Discovery of bicyclic pyrazoles as class III histone deacetylase SIRT1 and SIRT2 inhibitors. Bioorg Med Chem Lett25:2514-8 (2015) 
 
NAD-dependent protein deacetylase sirtuin-1
Name:NAD-dependent protein deacetylase sirtuin-1
Type:Developmental protein; hydrolase
Mol. Mass.:81626.66
Organism:Homo sapiens (Human)
Description:n/a
Residue:747
BDBM50088294
NameBDBM50088294
Synonyms:CHEMBL3427761
TypeSmall organic molecule
Emp. Form.C15H14N4OS
Mol. Mass.298.363
SMILESNC(=O)C1CCCc2c1[nH]nc2-c1nc2ccccc2s1