Reaction Details
TargetGTPase KRas
LigandBDBM50088354
Substrate/Competitorn/a
Meas. Tech.ChEMBL_1476956 (CHEMBL3430211)
Kd 190000±n/a nM
Citation Magee, TV Progress in discovery of small-molecule modulators of protein-protein interactions via fragment screening. Bioorg Med Chem Lett25:2461-8 (2015) 
 
GTPase KRas
Name:GTPase KRas
Type:PROTEIN
Mol. Mass.:21656.10
Organism:Homo sapiens (Human)
Description:ChEMBL_1476955
Residue:189
BDBM50088354
NameBDBM50088354
Synonyms:CHEMBL2086795
TypeSmall organic molecule
Emp. Form.C22H25N5O
Mol. Mass.375.4668
SMILESCC[C@H](C)[C@H](N)C(=O)Nc1ccc2nc(Cc3c[nH]c4ccccc34)[nH]c2c1