Reaction Details
TargetGTPase KRas
LigandBDBM50088364
Substrate/Competitorn/a
Meas. Tech.ChEMBL_1476956 (CHEMBL3430211)
Kd 2000000±n/a nM
Citation Magee, TV Progress in discovery of small-molecule modulators of protein-protein interactions via fragment screening. Bioorg Med Chem Lett25:2461-8 (2015) 
 
GTPase KRas
Name:GTPase KRas
Type:PROTEIN
Mol. Mass.:21656.10
Organism:Homo sapiens (Human)
Description:ChEMBL_1476955
Residue:189
BDBM50088364
NameBDBM50088364
Synonyms:CHEMBL2396993
TypeSmall organic molecule
Emp. Form.C17H15N3
Mol. Mass.261.3211
SMILESCc1[nH]c2ccccc2c1Cc1nc2ccccc2[nH]1