Reaction Details
TargetSodium channel protein type 5 subunit alpha
LigandBDBM50017674
Substrate/Competitorn/a
Meas. Tech.ChEMBL_1478676 (CHEMBL3430577)
IC50 41000±n/a nM
Citation Mirams, GRCui, YSher, AFink, MCooper, JHeath, BMMcMahon, NCGavaghan, DJNoble, D Simulation of multiple ion channel block provides improved early prediction of compounds' clinical torsadogenic risk. Cardiovasc Res91:53-61 (2011) 
 
Sodium channel protein type 5 subunit alpha
Name:Sodium channel protein type 5 subunit alpha
Type:Enzyme
Mol. Mass.:226908.60
Organism:Homo sapiens (Human)
Description:Q14524
Residue:2016
BDBM50017674
NameBDBM50017674
Synonyms:(2-Benzhydryloxy-ethyl)-dimethyl-amine 2-(diphenylmethoxy)-N,N-dimethylethanamine Beldin Benadryl CHEMBL657 DIPHENHYDRAMINE Diphen N-[2-(BENZHYDRYLOXY)ETHYL]-N,N-DIMETHYLAMINE US9138431, DIPHENHYDRAMINE (Benadryl) | US9333199, DIPHENHYDRAMINE (Benadryl)
TypeSmall organic molecule
Emp. Form.C17H21NO
Mol. Mass.255.3547
SMILESCN(C)CCOC(c1ccccc1)c1ccccc1