Reaction Details
TargetSodium channel protein type 7 subunit alpha
LigandBDBM50117922
Substrate/Competitorn/a
Meas. Tech.ChEMBL_1478682 (CHEMBL3430583)
IC50 980±n/a nM
Citation Mirams, GRCui, YSher, AFink, MCooper, JHeath, BMMcMahon, NCGavaghan, DJNoble, D Simulation of multiple ion channel block provides improved early prediction of compounds' clinical torsadogenic risk. Cardiovasc Res91:53-61 (2011) 
 
Sodium channel protein type 7 subunit alpha
Name:Sodium channel protein type 7 subunit alpha
Type:PROTEIN
Mol. Mass.:193514.99
Organism:Homo sapiens (Human)
Description:ChEMBL_105639
Residue:1682
BDBM50117922
NameBDBM50117922
Synonyms:(1S,2S)-2-(2-((3-(1H-benzo[d]imidazol-2-yl)propyl)(methyl)amino)ethyl)-6-fluoro-1-isopropyl-1,2,3,4-tetrahydronaphthalen-2-yl 2-methoxyacetate CHEMBL45816 Methoxy-acetic acid (1S,2S)-2-(2-{[3-(1H-benzoimidazol-2-yl)-propyl]-methyl-amino}-ethyl)-6-fluoro-1-isopropyl-1,2,3,4-tetrahydro-naphthalen-2-yl ester Mibefradil dihydrochloride
TypeSmall organic molecule
Emp. Form.C29H38FN3O3
Mol. Mass.495.6287
SMILESCOCC(=O)O[C@]1(CCN(C)CCCc2nc3ccccc3[nH]2)CCc2cc(F)ccc2[C@@H]1C(C)C