Reaction Details
TargetSodium channel protein type 7 subunit alpha
LigandBDBM50318494
Substrate/Competitorn/a
Meas. Tech.ChEMBL_1478684 (CHEMBL3430585)
IC50 36000±n/a nM
Citation Mirams, GRCui, YSher, AFink, MCooper, JHeath, BMMcMahon, NCGavaghan, DJNoble, D Simulation of multiple ion channel block provides improved early prediction of compounds' clinical torsadogenic risk. Cardiovasc Res91:53-61 (2011) 
 
Sodium channel protein type 7 subunit alpha
Name:Sodium channel protein type 7 subunit alpha
Type:PROTEIN
Mol. Mass.:193514.99
Organism:Homo sapiens (Human)
Description:ChEMBL_105639
Residue:1682
BDBM50318494
NameBDBM50318494
Synonyms:3-ethyl 5-methyl 2,6-dimethyl-4-(3-nitrophenyl)-1,4-dihydropyridine-3,5-dicarboxylate NITRENDIPINE | cid_4507
TypeSmall organic molecule
Emp. Form.C18H20N2O6
Mol. Mass.360.3612
SMILESCCOC(=O)C1=C(C)N=C(C)C(C1c1cccc(c1)[N+]([O-])=O)C(=O)OC