Reaction Details
TargetVoltage-dependent L-type calcium channel subunit alpha-1C
LigandBDBM50003655
Substrate/Competitorn/a
Meas. Tech.ChEMBL_1478714 (CHEMBL3430615)
IC50 103000±n/a nM
Citation Mirams, GRCui, YSher, AFink, MCooper, JHeath, BMMcMahon, NCGavaghan, DJNoble, D Simulation of multiple ion channel block provides improved early prediction of compounds' clinical torsadogenic risk. Cardiovasc Res91:53-61 (2011) 
 
Voltage-dependent L-type calcium channel subunit alpha-1C
Name:Voltage-dependent L-type calcium channel subunit alpha-1C
Type:PROTEIN
Mol. Mass.:19518.62
Organism:Cavia porcellus
Description:ChEMBL_106600
Residue:169
BDBM50003655
NameBDBM50003655
Synonyms:Phenytoin
TypeSmall organic molecule
Emp. Form.C15H12N2O2
Mol. Mass.252.268
SMILESO=C1NC(=O)C(N1)(c1ccccc1)c1ccccc1