Reaction Details
TargetPotassium voltage-gated channel subfamily H member 2
LigandBDBM18957
Substrate/Competitorn/a
Meas. Tech.ChEMBL_1478727 (CHEMBL3430628)
IC50 30±n/a nM
Citation Mirams, GRCui, YSher, AFink, MCooper, JHeath, BMMcMahon, NCGavaghan, DJNoble, D Simulation of multiple ion channel block provides improved early prediction of compounds' clinical torsadogenic risk. Cardiovasc Res91:53-61 (2011) 
 
Potassium voltage-gated channel subfamily H member 2
Name:Potassium voltage-gated channel subfamily H member 2
Type:Multi-pass membrane protein
Mol. Mass.:126672.65
Organism:Homo sapiens (Human)
Description:Q12809
Residue:1159
BDBM18957
NameBDBM18957
Synonyms:(2-{4-[(2-butyl-1-benzofuran-3-yl)carbonyl]-2,6-diiodophenoxy}ethyl)diethylamine Amiodarone Cordarone cid_441325
TypeSmall organic molecule
Emp. Form.C25H29I2NO3
Mol. Mass.645.3116
SMILESCCCCc1oc2ccccc2c1C(=O)c1cc(I)c(OCCN(CC)CC)c(I)c1