Reaction Details
TargetPotassium voltage-gated channel subfamily H member 2
LigandBDBM50017723
Substrate/Competitorn/a
Meas. Tech.ChEMBL_1478746 (CHEMBL3430647)
IC50 65±n/a nM
Citation Mirams, GRCui, YSher, AFink, MCooper, JHeath, BMMcMahon, NCGavaghan, DJNoble, D Simulation of multiple ion channel block provides improved early prediction of compounds' clinical torsadogenic risk. Cardiovasc Res91:53-61 (2011) 
 
Potassium voltage-gated channel subfamily H member 2
Name:Potassium voltage-gated channel subfamily H member 2
Type:Multi-pass membrane protein
Mol. Mass.:126672.65
Organism:Homo sapiens (Human)
Description:Q12809
Residue:1159
BDBM50017723
NameBDBM50017723
Synonyms:(3,3-Diphenyl-propyl)-(1-methyl-2-phenyl-ethyl)-amine Prenylamine | Prenylamine(3,3-Diphenyl-propyl)-(1-methyl-2-phenyl-ethyl)-amine
TypeSmall organic molecule
Emp. Form.C24H27N
Mol. Mass.329.4779
SMILESCC(Cc1ccccc1)NCCC(c1ccccc1)c1ccccc1