Reaction Details
TargetPotassium voltage-gated channel subfamily D member 3
LigandBDBM50165008
Substrate/Competitorn/a
Meas. Tech.ChEMBL_1478665 (CHEMBL3430566)
IC50 12589±n/a nM
Citation Mirams, GRDavies, MRBrough, SJBridgland-Taylor, MHCui, YGavaghan, DJAbi-Gerges, N Prediction of Thorough QT study results using action potential simulations based on ion channel screens. J Pharmacol Toxicol Methods70:246-54 (2014) 
 
Potassium voltage-gated channel subfamily D member 3
Name:Potassium voltage-gated channel subfamily D member 3
Type:PROTEIN
Mol. Mass.:73464.62
Organism:Homo sapiens (Human)
Description:ChEMBL_1478652
Residue:655
BDBM50165008
NameBDBM50165008
Synonyms:(+)-(R)-2-(alpha-(2-(Diisopropylamino)ethyl)benzyl)-p-cresol 2-[(1R)-3-(diisopropylamino)-1-phenylpropyl]-4-methylphenol TOLTERODINE
TypeSmall organic molecule
Emp. Form.C22H31NO
Mol. Mass.325.4876
SMILESCC(C)N(CC[C@H](c1ccccc1)c1cc(C)ccc1O)C(C)C