Reaction Details
TargetSodium channel protein type 5 subunit alpha
LigandBDBM84745
Substrate/Competitorn/a
Meas. Tech.ChEMBL_1478554 (CHEMBL3430455)
IC50 15849±n/a nM
Citation Mirams, GRDavies, MRBrough, SJBridgland-Taylor, MHCui, YGavaghan, DJAbi-Gerges, N Prediction of Thorough QT study results using action potential simulations based on ion channel screens. J Pharmacol Toxicol Methods70:246-54 (2014) 
 
Sodium channel protein type 5 subunit alpha
Name:Sodium channel protein type 5 subunit alpha
Type:Enzyme
Mol. Mass.:226908.60
Organism:Homo sapiens (Human)
Description:Q14524
Residue:2016
BDBM84745
NameBDBM84745
Synonyms:CAS_136434-34-9 LY-248686 USRE49340, Rank 5
TypeSmall organic molecule
Emp. Form.C18H19NOS
Mol. Mass.297.415
SMILESCNCC[C@H](Oc1cccc2ccccc12)c1cccs1