Reaction Details
TargetPotassium voltage-gated channel subfamily H member 2
LigandBDBM50031299
Substrate/Competitorn/a
Meas. Tech.ChEMBL_1478863 (CHEMBL3430335)
IC50 251189±n/a nM
Citation Mirams, GRDavies, MRBrough, SJBridgland-Taylor, MHCui, YGavaghan, DJAbi-Gerges, N Prediction of Thorough QT study results using action potential simulations based on ion channel screens. J Pharmacol Toxicol Methods70:246-54 (2014) 
 
Potassium voltage-gated channel subfamily H member 2
Name:Potassium voltage-gated channel subfamily H member 2
Type:Multi-pass membrane protein
Mol. Mass.:126672.65
Organism:Homo sapiens (Human)
Description:Q12809
Residue:1159
BDBM50031299
NameBDBM50031299
Synonyms:6-(2,3-Dichloro-phenyl)-[1,2,4]triazine-3,5-diamine 6-(2,3-dichlorophenyl)-1,2,4-triazine-3,5-diamine CHEMBL741 Lamictal | Lamictal cd
TypeSmall organic molecule
Emp. Form.C9H7Cl2N5
Mol. Mass.256.091
SMILESNc1nnc(c(N)n1)-c1cccc(Cl)c1Cl