Reaction Details
TargetSodium channel protein type 5 subunit alpha
LigandBDBM50248106
Substrate/Competitorn/a
Meas. Tech.ChEMBL_1478555 (CHEMBL3430456)
IC50 316228±n/a nM
Citation Mirams, GRDavies, MRBrough, SJBridgland-Taylor, MHCui, YGavaghan, DJAbi-Gerges, N Prediction of Thorough QT study results using action potential simulations based on ion channel screens. J Pharmacol Toxicol Methods70:246-54 (2014) 
 
Sodium channel protein type 5 subunit alpha
Name:Sodium channel protein type 5 subunit alpha
Type:Enzyme
Mol. Mass.:226908.60
Organism:Homo sapiens (Human)
Description:Q14524
Residue:2016
BDBM50248106
NameBDBM50248106
Synonyms:CHEMBL461101 Eltrombopag olamine
TypeSmall organic molecule
Emp. Form.C25H22N4O4
Mol. Mass.442.4666
SMILESCc1[nH]n(-c2ccc(C)c(C)c2)c(=O)c1N=Nc1cccc(-c2cccc(c2)C(O)=O)c1O