Reaction Details
TargetVoltage-dependent L-type calcium channel subunit alpha-1C
LigandBDBM50088387
Substrate/Competitorn/a
Meas. Tech.ChEMBL_1479078 (CHEMBL3436054)
IC50 79±n/a nM
Citation Wisniowska, BMendyk, AFijorek, KGlinka, APolak, S Predictive model for L-type channel inhibition: multichannel block in QT prolongation risk assessment. J Appl Toxicol32:858-66 (2012) 
 
Voltage-dependent L-type calcium channel subunit alpha-1C
Name:Voltage-dependent L-type calcium channel subunit alpha-1C
Type:PROTEIN
Mol. Mass.:19518.62
Organism:Cavia porcellus
Description:ChEMBL_106600
Residue:169
BDBM50088387
NameBDBM50088387
Synonyms:Clevidipine Cleviprex
TypeSmall organic molecule
Emp. Form.C21H23Cl2NO6
Mol. Mass.456.316
SMILESCCCC(=O)OCOC(=O)C1=C(C)NC(C)=C(C1c1cccc(Cl)c1Cl)C(=O)OC