Reaction Details
TargetVoltage-dependent L-type calcium channel subunit alpha-1C
LigandBDBM19459
Substrate/Competitorn/a
Meas. Tech.ChEMBL_1479110 (CHEMBL3436086)
IC50 11000±n/a nM
Citation Wisniowska, BMendyk, AFijorek, KGlinka, APolak, S Predictive model for L-type channel inhibition: multichannel block in QT prolongation risk assessment. J Appl Toxicol32:858-66 (2012) 
 
Voltage-dependent L-type calcium channel subunit alpha-1C
Name:Voltage-dependent L-type calcium channel subunit alpha-1C
Type:Enzyme Catalytic Domain
Mol. Mass.:243492.26
Organism:RAT
Description:Calcium channel 0 RAT::P22002
Residue:2169
BDBM19459
NameBDBM19459
Synonyms:5,7-dihydroxy-3-(4-hydroxyphenyl)-4H-chromen-4-one Genistein Genisteol US8552057, 2 | cid_5280961
TypePhytoestrogen
Emp. Form.C15H10O5
Mol. Mass.270.2369
SMILESOc1ccc(cc1)-c1coc2cc(O)cc(O)c2c1=O