Reaction Details
TargetVoltage-dependent L-type calcium channel subunit alpha-1C
LigandBDBM50341448
Substrate/Competitorn/a
Meas. Tech.ChEMBL_1479067 (CHEMBL3436225)
IC50 20200±n/a nM
Citation Wisniowska, BMendyk, AFijorek, KGlinka, APolak, S Predictive model for L-type channel inhibition: multichannel block in QT prolongation risk assessment. J Appl Toxicol32:858-66 (2012) 
 
Voltage-dependent L-type calcium channel subunit alpha-1C
Name:Voltage-dependent L-type calcium channel subunit alpha-1C
Type:PROTEIN
Mol. Mass.:19518.62
Organism:Cavia porcellus
Description:ChEMBL_106600
Residue:169
BDBM50341448
NameBDBM50341448
Synonyms:4-(4-Chloro-benzyl)-2-(1-methyl-azepan-4-yl)-2H-phthalazin-1-one Astelin CHEMBL639 Optivar US20230414632, Compound II-a | rac-Azelastine
TypeSmall organic molecule
Emp. Form.C22H24ClN3O
Mol. Mass.381.898
SMILESCN1CCCC(CC1)n1nc(Cc2ccc(Cl)cc2)c2ccccc2c1=O