Reaction Details
TargetVoltage-dependent L-type calcium channel subunit alpha-1C
LigandBDBM50436176
Substrate/Competitorn/a
Meas. Tech.ChEMBL_1479117 (CHEMBL3436093)
IC50 2.2±n/a nM
Citation Wisniowska, BMendyk, AFijorek, KGlinka, APolak, S Predictive model for L-type channel inhibition: multichannel block in QT prolongation risk assessment. J Appl Toxicol32:858-66 (2012) 
 
Voltage-dependent L-type calcium channel subunit alpha-1C
Name:Voltage-dependent L-type calcium channel subunit alpha-1C
Type:Enzyme Catalytic Domain
Mol. Mass.:248979.79
Organism:Homo sapiens (Human)
Description:Calcium channel (Type L) 0 HUMAN::Q13936
Residue:2221
BDBM50436176
NameBDBM50436176
Synonyms:Dynacirc ISRADIPINE PN-200-110
TypeSmall organic molecule
Emp. Form.C19H21N3O5
Mol. Mass.371.3871
SMILESCOC(=O)C1=C(C)NC(C)=C(C1c1cccc2nonc12)C(=O)OC(C)C