Reaction Details
TargetVoltage-dependent L-type calcium channel subunit alpha-1C
LigandBDBM50002338
Substrate/Competitorn/a
Meas. Tech.ChEMBL_1479168 (CHEMBL3436144)
IC50 1300±n/a nM
Citation Wisniowska, BMendyk, AFijorek, KGlinka, APolak, S Predictive model for L-type channel inhibition: multichannel block in QT prolongation risk assessment. J Appl Toxicol32:858-66 (2012) 
 
Voltage-dependent L-type calcium channel subunit alpha-1C
Name:Voltage-dependent L-type calcium channel subunit alpha-1C
Type:PROTEIN
Mol. Mass.:19518.62
Organism:Cavia porcellus
Description:ChEMBL_106600
Residue:169
BDBM50002338
NameBDBM50002338
Synonyms:(Thioridazine)10-[2-(1-Methyl-piperidin-2-yl)-ethyl]-2-methylsulfanyl-10H-phenothiazine 10-[2-(1-Methyl-piperidin-2-yl)-ethyl]-2-methylsulfanyl-10H-phenothiazine CHEMBL479 MELLARIL-S TP-21 | US9504692, Thioridazine
TypeSmall organic molecule
Emp. Form.C21H26N2S2
Mol. Mass.370.575
SMILESCSc1ccc2Sc3ccccc3N(CCC3CCCCN3C)c2c1