Reaction Details
TargetVoltage-dependent L-type calcium channel subunit alpha-1C
LigandBDBM50121975
Substrate/Competitorn/a
Meas. Tech.ChEMBL_1479150 (CHEMBL3436126)
IC50 19820±n/a nM
Citation Wisniowska, BMendyk, AFijorek, KGlinka, APolak, S Predictive model for L-type channel inhibition: multichannel block in QT prolongation risk assessment. J Appl Toxicol32:858-66 (2012) 
 
Voltage-dependent L-type calcium channel subunit alpha-1C
Name:Voltage-dependent L-type calcium channel subunit alpha-1C
Type:Enzyme Catalytic Domain
Mol. Mass.:248979.79
Organism:Homo sapiens (Human)
Description:Calcium channel (Type L) 0 HUMAN::Q13936
Residue:2221
BDBM50121975
NameBDBM50121975
Synonyms:(6-Methoxy-quinolin-4-yl)-(5-vinyl-1-aza-bicyclo[2.2.2]oct-2-yl)-methanol CHEMBL1294 DURAQUIN QUINAGLUTE QUINATIME QUINIDINE US9402878, Quinidine
TypeSmall organic molecule
Emp. Form.C20H24N2O2
Mol. Mass.324.4168
SMILESCOc1ccc2nccc([C@H](O)[C@H]3C[C@@H]4CCN3C[C@@H]4C=C)c2c1