Reaction Details
TargetVoltage-dependent L-type calcium channel subunit alpha-1C
LigandBDBM50101817
Substrate/Competitorn/a
Meas. Tech.ChEMBL_1479130 (CHEMBL3436106)
IC50 300±n/a nM
Citation Wisniowska, BMendyk, AFijorek, KGlinka, APolak, S Predictive model for L-type channel inhibition: multichannel block in QT prolongation risk assessment. J Appl Toxicol32:858-66 (2012) 
 
Voltage-dependent L-type calcium channel subunit alpha-1C
Name:Voltage-dependent L-type calcium channel subunit alpha-1C
Type:PROTEIN
Mol. Mass.:19518.62
Organism:Cavia porcellus
Description:ChEMBL_106600
Residue:169
BDBM50101817
NameBDBM50101817
Synonyms:Adalat Afeditab Cr CHEBI:7565 Procardia | Procardia Xl
TypeSmall organic molecule
Emp. Form.C17H18N2O6
Mol. Mass.346.3346
SMILESCOC(=O)C1=C(C)NC(C)=C(C1c1ccccc1[N+]([O-])=O)C(=O)OC