Reaction Details
TargetVoltage-dependent L-type calcium channel subunit alpha-1C
LigandBDBM78577
Substrate/Competitorn/a
Meas. Tech.ChEMBL_1479074 (CHEMBL3436050)
IC50 2600±n/a nM
Citation Wisniowska, BMendyk, AFijorek, KGlinka, APolak, S Predictive model for L-type channel inhibition: multichannel block in QT prolongation risk assessment. J Appl Toxicol32:858-66 (2012) 
 
Voltage-dependent L-type calcium channel subunit alpha-1C
Name:Voltage-dependent L-type calcium channel subunit alpha-1C
Type:PROTEIN
Mol. Mass.:19518.62
Organism:Cavia porcellus
Description:ChEMBL_106600
Residue:169
BDBM78577
NameBDBM78577
Synonyms:BEPRIDIL HYDROCHLORIDE MLS000028456 N-[3-(2-methylpropoxy)-2-pyrrolidin-1-yl-propyl]-N-(phenylmethyl)aniline;hydrochloride SMR000058419 cid_50088
TypeSmall organic molecule
Emp. Form.C24H34N2O
Mol. Mass.366.5396
SMILESCC(C)COCC(CN(Cc1ccccc1)c1ccccc1)N1CCCC1