Reaction Details
TargetBile salt export pump
LigandBDBM39347
Substrate/Competitorn/a
Meas. Tech.ChEMBL_1481883 (CHEMBL3540574)
IC50 35000±n/a nM
Citation Dawson, SStahl, SPaul, NBarber, JKenna, JG In vitro inhibition of the bile salt export pump correlates with risk of cholestatic drug-induced liver injury in humans. Drug Metab Dispos40:130-8 (2011) 
 
Bile salt export pump
Name:Bile salt export pump
Type:PROTEIN
Mol. Mass.:146267.86
Organism:Rattus norvegicus
Description:ChEMBL_1481883
Residue:1321
BDBM39347
NameBDBM39347
Synonyms:CLOBETASOL PROPIONATE SMR000058745 | cid_32798
TypeSmall organic molecule
Emp. Form.C25H32ClFO5
Mol. Mass.466.97
SMILESCCC(=O)O[C@@]1([C@@H](C)C[C@H]2[C@@H]3CCC4=CC(=O)C=C[C@]4(C)[C@@]3(F)[C@@H](O)C[C@]12C)C(=O)CCl