Reaction Details
TargetBile salt export pump
LigandBDBM50391000
Substrate/Competitorn/a
Meas. Tech.ChEMBL_1481882 (CHEMBL3540573)
IC50 6300±n/a nM
Citation Dawson, SStahl, SPaul, NBarber, JKenna, JG In vitro inhibition of the bile salt export pump correlates with risk of cholestatic drug-induced liver injury in humans. Drug Metab Dispos40:130-8 (2011) 
 
Bile salt export pump
Name:Bile salt export pump
Type:Protein
Mol. Mass.:146405.49
Organism:Homo sapiens (Human)
Description:O95342
Residue:1321
BDBM50391000
NameBDBM50391000
Synonyms:CB-01-11 | RIFAMYCIN
TypeSmall organic molecule
Emp. Form.C37H47NO12
Mol. Mass.697.7686
SMILESCO[C@H]1\C=C\O[C@@]2(C)Oc3c(C2=O)c2c(O)cc(NC(=O)\C(C)=C/C=C/[C@H](C)[C@H](O)[C@@H](C)[C@@H](O)[C@@H](C)[C@H](OC(C)=O)[C@@H]1C)c(O)c2c(O)c3C