Reaction Details
TargetGlutamate carboxypeptidase 2
LigandBDBM50392045
Substrate/Competitorn/a
Meas. Tech.ChEMBL_1487181 (CHEMBL3533357)
Ki 1.000000±n/a nM
Citation Rais, RHoover, RWozniak, KRudek, MATsukamoto, TAlt, JRojas, CSlusher, BS Reversible disulfide formation of the glutamate carboxypeptidase II inhibitor E2072 results in prolonged systemic exposures in vivo. Drug Metab Dispos40:2315-23 (2012) 
 
Glutamate carboxypeptidase 2
Name:Glutamate carboxypeptidase 2
Type:PROTEIN
Mol. Mass.:84333.66
Organism:Homo sapiens (Human)
Description:ChEMBL_1497035
Residue:750
BDBM50392045
NameBDBM50392045
Synonyms:CHEMBL2152561
TypeSmall organic molecule
Emp. Form.C16H14O4S
Mol. Mass.302.345
SMILESOC(=O)c1cccc(c1)-c1cccc(CCS)c1C(O)=O