Reaction Details
TargetAldehyde oxidase
LigandBDBM50187243
Substrate/Competitorn/a
Meas. Tech.ChEMBL_1481152 (CHEMBL3537682)
Ki 3600±n/a nM
Citation Barr, JTJones, JP Evidence for substrate-dependent inhibition profiles for human liver aldehyde oxidase. Drug Metab Dispos41:24-9 (2012) 
 
Aldehyde oxidase
Name:Aldehyde oxidase
Type:PROTEIN
Mol. Mass.:147930.97
Organism:Homo sapiens (Human)
Description:ChEMBL_1481150
Residue:1338
BDBM50187243
NameBDBM50187243
Synonyms:17-ethinyl-3,17-estradiol 17-ethinylestradiol 17alpha-ethynylestra-1,3,5(10)-triene-3,17beta-diol CHEMBL691 Ethinylestradiol ethinyloestradiol
TypeSmall organic molecule
Emp. Form.C20H24O2
Mol. Mass.296.4034
SMILESC[C@]12CC[C@H]3[C@@H](CCc4cc(O)ccc34)[C@@H]1CC[C@@]2(O)C#C