Reaction Details
TargetAldehyde oxidase
LigandBDBM50001884
Substrate/Competitorn/a
Meas. Tech.ChEMBL_1481151 (CHEMBL3537681)
Ki 5100±n/a nM
Citation Barr, JTJones, JP Evidence for substrate-dependent inhibition profiles for human liver aldehyde oxidase. Drug Metab Dispos41:24-9 (2012) 
 
Aldehyde oxidase
Name:Aldehyde oxidase
Type:PROTEIN
Mol. Mass.:147930.97
Organism:Homo sapiens (Human)
Description:ChEMBL_1481150
Residue:1338
BDBM50001884
NameBDBM50001884
Synonyms:2-[4-(4-Methyl-benzyl)-piperazin-1-yl]-1-(2-methyl-2,3-dihydro-indol-1-yl)-ethanone 3-chloro-6-(4-methyl-piperazin-1-yl)-5H-dibenzo[b,e][1,4]diazepine 8-Chloro-11-(4-methyl-piperazin-1-yl)-5H-dibenzo[b,e][1,4]diazepine( Clozepine ) 8-Chloro-11-(4-methyl-piperazin-1-yl)-5H-dibenzo[b,e][1,4]diazepine(Clopazine) 8-chloro-11-(4-methylpiperazin-1-yl)-5H-dibenzo[b,e][1,4]diazepine CHEMBL538973 CLOZAPINE, 8-CHLORO-11-(4-METHYL-PIPERAZIN-1-YL)-5H-DIBENZO[B,E][1,4]DIAZEPINE HF 1854 US10752588, Compound Clozapine | US11498896, Compound Clozapine
TypeSmall organic molecule
Emp. Form.C18H19ClN4
Mol. Mass.326.823
SMILESCN1CCN(CC1)C1=Nc2cc(Cl)ccc2Nc2ccccc12