Reaction Details
TargetArylacetamide deacetylase
LigandBDBM50370232
Substrate/Competitorn/a
Meas. Tech.ChEMBL_1481147 (CHEMBL3537677)
Ki 200000±n/a nM
Citation Kobayashi, YFukami, TNakajima, AWatanabe, ANakajima, MYokoi, T Species differences in tissue distribution and enzyme activities of arylacetamide deacetylase in human, rat, and mouse. Drug Metab Dispos40:671-9 (2012) 
 
Arylacetamide deacetylase
Name:Arylacetamide deacetylase
Type:PROTEIN
Mol. Mass.:45743.18
Organism:Homo sapiens (Human)
Description:ChEMBL_109673
Residue:399
BDBM50370232
NameBDBM50370232
Synonyms:BA-41166E RIFAMPIN Rifampicin
TypeSmall organic molecule
Emp. Form.C43H58N4O12
Mol. Mass.822.9402
SMILESCO[C@H]1\C=C\O[C@@]2(C)Oc3c(C2=O)c2c(O)c(\C=N\N4CCN(C)CC4)c(NC(=O)\C(C)=C/C=C/[C@H](C)[C@H](O)[C@@H](C)[C@@H](O)[C@@H](C)[C@H](OC(C)=O)[C@@H]1C)c(O)c2c(O)c3C